{"text_format":"1","workbook":"xlsx","n_sheets":2,"sheets":["Funding","Pro Forma"],"not_rendered":{"charts":0,"images":0,"macros":1,"external_links":1,"defined_names":356,"comments":2,"pivot_tables":0},"unopened":[],"bounds":{"document_bytes":16777216,"sheet_cells":100000,"rows_first":2000,"rows_last":500,"rows_between":2000,"halvings":0,"cell_chars":16384,"cell_head_chars":4096},"cells_cut":0,"cells_raw":0,"read":"whole","date_system":"1900"}

{"sheet":"Funding","index":0,"n_rows":187,"n_cols":51,"rows_kept":187,"cut":false,"hidden":false,"merged":[[165,33,165,39],[166,33,166,39],[167,33,167,39],[168,33,168,39],[13,5,13,8],[39,10,39,11],[163,33,163,39],[164,33,164,39],[15,5,15,8],[16,5,16,8],[27,10,27,11],[18,10,18,11],[43,10,43,11],[47,10,47,11],[51,10,51,11],[52,3,55,11],[8,5,8,8],[9,5,9,8],[10,5,10,8],[11,5,11,8],[12,5,12,8],[36,6,36,7],[37,6,37,7],[36,8,36,11],[37,8,37,11],[39,4,39,9],[56,2,56,11],[62,4,62,11],[65,4,65,10],[68,4,68,8],[0,0,0,11],[4,1,4,11],[27,2,27,9],[29,2,29,11],[31,10,31,11],[41,10,41,11],[21,5,21,6],[22,5,22,6],[23,5,23,6],[24,5,24,6],[25,5,25,6],[31,2,31,9],[71,4,71,6],[73,4,73,10],[74,4,74,8],[76,4,76,10],[80,4,80,11],[92,3,92,11],[94,3,94,10],[96,3,96,11],[98,3,98,11],[82,4,82,8],[84,4,84,8],[86,4,86,8],[88,4,88,11],[90,3,90,11]]}
["Exhibit A\nRFA 2023-211 Construction Inflation Response Viability Funding"]
[]
["A.","Criteria and Timing"]
[]
[null,"Applicants will continue to be held to the terms and conditions of the RFA under which the Active Award was made and the applicable rule chapter in effect at the time of the Original Application.  The eligibility criteria and timing requirements are outlined in this RFA."]
[]
["B.","Required Information"]
[]
[null,1,"Name of Development",null,null,"<select one>"]
[null,null,"Name of Applicant",null,null,{"$f":"IF(ISERROR(VLOOKUP($F$9,AppSubRptData,6)),\" \",VLOOKUP($F$9,AppSubRptData,6))","v":0},null,null,null,null,"Original RFA #",{"$f":"IF(F9=\"<select one>\",\"\",IF(ISERROR(VLOOKUP($F$9,AppSubRptData,3)),\" \",VLOOKUP($F$9,AppSubRptData,3)))","v":""}]
[null,null,"Name of County",null,null,{"$f":"IF(ISERROR(VLOOKUP($F$9,AppSubRptData,5)),\" \",VLOOKUP($F$9,AppSubRptData,5))","v":0},null,null,null,null,"Original App #",{"$f":"IF(F9=\"<select one>\",\"\",IF(ISERROR(VLOOKUP($F$9,AppSubRptData,2)),\" \",VLOOKUP($F$9,AppSubRptData,2)))","v":""}]
[null,null,"Demographic",null,null,{"$f":"IF(ISERROR(VLOOKUP($F$9,AppSubRptData,10)),\" \",VLOOKUP($F$9,AppSubRptData,10))","v":0}]
[null,null,"Development Category",null,null,{"$f":"IF(ISERROR(VLOOKUP($F$9,AppSubRptData,11)),\" \",VLOOKUP($F$9,AppSubRptData,11))","v":0}]
[null,null,"Number of Units",null,null,{"$f":"IF(ISERROR(VLOOKUP($F$9,AppSubRptData,13)),\" \",VLOOKUP($F$9,AppSubRptData,13))","v":0}]
[]
[null,null,"Authorized Principal",null,null,{"$f":"IF(ISERROR(VLOOKUP($F$9,AppSubRptData,14)),\" \",VLOOKUP($F$9,AppSubRptData,14))","v":0}]
[null,null,"Operational Contact",null,null,{"$f":"IF(ISERROR(VLOOKUP($F$9,AppSubRptData,15)),\" \",VLOOKUP($F$9,AppSubRptData,15))","v":0}]
[]
[null,null,"What Date was the Applicant invited to answer Credit Underwriting?",null,null,null,null,null,null,null,{"$f":"IF(F9=\"<select one>\",\"\",IF(ISERROR(VLOOKUP($F$9,AppSubRptData,16)),\" \",VLOOKUP($F$9,AppSubRptData,16)))","v":""}]
[]
[null,null,"Competitive Active Awards:"]
[null,null,null,"SAIL",null,{"$f":"IF(ISERROR(VLOOKUP($F$9,AppSubRptData,25)),\" \",VLOOKUP($F$9,AppSubRptData,25))","v":0}]
[null,null,null,"ELI",null,{"$f":"IF(ISERROR(VLOOKUP($F$9,AppSubRptData,26)),\" \",VLOOKUP($F$9,AppSubRptData,26))","v":0}]
[null,null,null,"NHTF",null,{"$f":"IF(ISERROR(VLOOKUP($F$9,AppSubRptData,27)),\" \",VLOOKUP($F$9,AppSubRptData,27))","v":0}]
[null,null,null,"HOME",null,{"$f":"IF(ISERROR(VLOOKUP($F$9,AppSubRptData,28)),\" \",VLOOKUP($F$9,AppSubRptData,28))","v":0}]
[null,null,null,"9%HC",null,{"$f":"IF(ISERROR(VLOOKUP($F$9,AppSubRptData,29)),\" \",VLOOKUP($F$9,AppSubRptData,29))","v":0}]
[]
[null,2,"Does the Original Application qualify as a Self-Sourced Application funded in RFA 2020-205 or RFA 2021-205?",null,null,null,null,null,null,null,{"$f":"IF(F9=\"<select one>\",\"\",IF(ISERROR(VLOOKUP($F$9,AppSubRptData,7)),\" \",VLOOKUP($F$9,AppSubRptData,7)))","v":""}]
[]
[null,null,"If “Yes”, to be eligible in this RFA, the Self-Sourced Applicant must knowingly, voluntarily and irrevocably commit to waive the option to convert the Development to market rate, including any option or right to submit a request for a qualified contract, after year 14, and any other option, right or process available to the Applicant to terminate (or that would result in the termination of) the 50-year set aside period at any time prior to the expiration of its full term."]
[]
[null,null,"Does the Self-Sourced Applicant waive the option to convert?",null,null,null,null,null,null,null,"<select one>"]
[]
[null,3,"Request Amount"]
[]
[null,null,"(a)","Maximum Viability Request Amount:"]
[null,null,null,"(1)","Per Unit Limit:",null,{"$f":"IF($F$9=\"<select one>\",\"\",IF(OR(N(Number_of_Units)<175,SUM(F22:G26)=0),125000,38000))","v":""},null,{"$f":"IF(N(G37)>0,TEXT(Number_of_Units,\"0\")&\" total units multiplied by \"&TEXT(G37,\"$#,##0\")&\" PU totals \"&TEXT(N(Number_of_Units)*N(G37),\"$#,##0\")&\".\",\"\")","v":""}]
[null,null,null,"(2)","Per Development Limit:",null,{"$f":"IF($F$9=\"<select one>\",\"\",IF(OR(N(Number_of_Units)<175,SUM(F22:G26)=0),4300000,15000000-N(SAIL_Request_Amount)-N(ELI_Request_Amount)-N(NHTF_Request_Amount)-N(HOME_Request_Amount)))","v":""},null,{"$f":"IF(F9=\"<select one>\",\"\",IF(N(G38)>0,IF(OR(N(Number_of_Units)<175,SUM(F22:G26)=0),\"The RFA limit for Developments with \"&IF(SUM(F22:G26)=0,\"either less than 175 units or has only been awarded non-competitive Corporation funding\",\"less than 175 units\")&\" is $4,300,000.\",\"The RFA limit for Developments with at least 175 units is $15,000,000, less any Active Awards of SAIL, ELI, NHTF and/or HOME, which for this Development totals \"&TEXT(N(SAIL_Request_Amount)+N(ELI_Request_Amount)+N(NHTF_Request_Amount)+N(HOME_Request_Amount),\"$#,##0\")&\", netting \"&TEXT(15000000-(N(SAIL_Request_Amount)+N(ELI_Request_Amount)+N(NHTF_Request_Amount)+N(HOME_Request_Amount)),\"$#,##0\")&\".\")))","v":""}]
[]
[null,null,null,null,"Lesser of Maximum Request Amount Per Development, or\nMaximum Request Amount via Per Unit Limit:",null,null,null,null,null,{"$f":"MIN(N(Number_of_Units)*N(G37),IF(OR(N(Number_of_Units)<175,SUM(F22:G26)=0),4300000,15000000-(N(SAIL_Request_Amount)+N(ELI_Request_Amount)+N(NHTF_Request_Amount)+N(HOME_Request_Amount))))","v":0}]
[]
[null,null,null,"Applicant's Viability Request Amount:"]
[]
[null,null,null,null,"Applicant's Eligible Viability Request Amount:",null,null,null,null,null,{"$f":"MIN(N(Max_Viability),N(Viability_Request_Amount))","v":0}]
[]
[null,null,"(b)","Updating Non-Competitive Housing Credit Request Amount, if applicable:"]
[]
[null,null,null,"Non-Competitive Housing Credit Request Amount (annual amount):"]
[]
[null,null,"(c)","Updating Corporation-Issued MMRB Loan Request Amount, if applicable:"]
[]
[null,null,null,"Corporation-Issued MMRB Loan Request Amount (if applicable):"]
[null,null,null,{"$f":"IF(AND(N(MMRB_Request_Amount)>0,N(MMRB_Request_Amount)<>ConstrAnalysis__1st_Mtg,ConstrAnalysis__1st_Type=\"FHFC - MMRB\"),\"Please ensure the FHFC - MMRB request is in the First Mortgage Financing line in the Construction Funding Sources section of the Pro Forma, and that the request amount matches the amount entered above. It currently does not match.\",IF(AND(N(MMRB_Request_Amount)>0,ConstrAnalysis__1st_Type<>\"FHFC - MMRB\"),\"Please ensure FHFC - MMRB is listed as the First Mortgage Financing's Lender/Type of Funding in the Construction Funding Sources section of the Pro Forma. It currently has not been selected.\",\"\"))","v":""}]
[]
[]
[]
[null,4,"Applicants must either return a recent Competitive Award OR commit to a limited number of Priority I Applications in certain RFAs in the 2023/2024 Funding Cycle by selecting option a. or b. below. "]
[]
[null,null,"(a)","Return of recent Competitive Housing Credit Award (“Returned Award”)"]
[]
{"$rows_left_out":128}
{"sheet":"Pro Forma","index":1,"n_rows":482,"n_cols":24,"rows_kept":482,"cut":false,"hidden":false,"merged":[[139,3,139,4],[73,3,73,4],[68,3,68,4],[188,3,188,4],[190,3,190,4],[193,3,193,4],[111,16,112,25],[104,16,105,25],[119,16,120,25],[129,16,130,25],[170,16,171,25],[155,16,156,25],[195,3,195,4],[194,16,195,25],[198,16,199,25],[430,11,430,13],[431,11,431,13],[432,11,432,13],[377,8,377,10],[378,8,378,10],[379,8,379,10],[370,3,370,13],[375,6,375,7],[376,6,376,7],[377,6,377,7],[378,6,378,7],[377,3,377,5],[378,3,378,5],[379,3,379,5],[375,11,375,13],[378,11,378,13],[376,3,376,5],[374,3,374,5],[375,3,375,5],[374,11,374,13],[400,11,400,13],[433,11,433,13],[434,11,434,13],[442,11,442,13],[443,11,443,13],[444,11,444,13],[446,11,446,13],[447,11,447,13],[448,11,448,13],[449,11,449,13],[435,11,435,13],[436,11,436,13],[437,11,437,13],[438,11,438,13],[450,11,450,13],[451,11,451,13],[445,11,445,13],[478,11,478,13],[479,11,479,13],[453,11,453,13],[457,11,457,13],[458,11,458,13],[459,11,459,13],[460,11,460,13],[461,11,461,13],[462,11,462,13],[463,11,463,13],[467,11,467,13],[468,11,468,13],[469,11,469,13],[470,11,470,13],[474,11,474,13],[475,11,475,13],[476,11,476,13],[477,11,477,13],[345,17,345,21],[333,10,333,13],[335,10,335,13],[337,10,337,13],[373,11,373,13],[368,10,368,12],[341,4,341,5],[371,3,371,5],[372,3,372,5],[373,3,373,5],[371,6,371,7],[371,8,371,10],[372,6,372,7],[373,6,373,7],[371,11,371,13],[339,17,340,22],[341,10,341,13],[343,10,343,13],[353,12,353,13],[345,10,346,13],[351,16,353,22],[331,10,331,13],[321,10,321,13],[293,4,293,5],[269,10,269,13],[279,10,279,13],[281,10,281,13],[283,10,283,13],[319,10,319,13],[343,4,343,5],[293,10,293,13],[295,10,295,13],[305,12,305,13],[297,17,297,21],[271,10,271,13],[313,10,313,13],[327,10,327,13],[329,10,329,13],[295,4,295,5],[308,16,311,25],[291,17,292,22],[265,10,265,13],[325,10,325,13],[265,17,267,23],[297,10,298,13],[303,16,305,22],[0,0,0,15],[273,10,273,13],[275,10,275,13],[277,10,277,13],[323,10,323,13],[37,10,37,13],[254,16,257,25],[62,16,63,25],[80,16,81,25],[84,16,85,25],[175,16,176,25],[94,16,95,25],[96,16,97,25],[109,16,110,25],[177,16,179,25],[196,16,197,25],[157,16,158,25],[163,16,164,25],[267,10,267,13],[249,5,251,14],[259,10,259,13],[39,16,41,25],[46,16,47,25],[39,6,39,13],[242,5,244,14],[121,16,122,25],[133,16,134,25],[125,16,126,25],[123,16,124,28],[127,16,128,25],[60,16,61,25],[48,16,49,25],[100,16,101,25],[115,16,116,25],[117,16,118,25],[180,16,181,25],[192,16,193,25],[233,5,237,14],[216,5,218,14],[220,5,222,14],[227,5,231,14],[67,16,68,25],[72,16,73,25],[138,16,139,25],[187,16,188,25],[189,16,190,25],[399,10,399,12],[379,6,379,7],[372,8,372,10],[373,8,373,10],[374,6,374,7],[379,11,379,13],[372,11,372,13],[384,10,384,12],[375,8,375,10],[376,8,376,10],[376,11,376,13],[374,8,374,10],[43,16,44,25],[197,3,197,4],[402,11,402,13],[412,11,412,13],[414,11,414,13],[416,11,417,13],[380,3,381,13],[387,11,387,13],[388,11,388,13],[389,11,389,13],[391,11,391,13],[392,11,392,13],[393,11,393,13],[395,11,395,13],[397,10,397,12],[386,10,386,12],[383,11,383,13],[396,11,396,13],[406,11,406,13],[404,11,404,13],[408,11,408,13],[410,11,410,13],[394,11,394,13],[377,11,377,13]]}
["Section 4.A.10\nDevelopment Cost Pro Forma"]
[null,{"$f":"\"RFA 2023-211 DEVELOPMENT COST PRO FORMA\"","v":"RFA 2023-211 DEVELOPMENT COST PRO FORMA"},null,null,null,null,null,null,null,null,null,null,null,null,null,{"$f":"\"(Page 1 of 6)\"","v":"(Page 1 of 6)"}]
[]
[null,null,null,"NOTES:",1,"Applicants will be held to the terms and conditions of the RFA under which the Active Award was made, and the applicable"]
[null,null,null,null,null,"rule chapter in effect at the time of the Original Application. This includes, but is not limited to, Developer Fee limits, Hard"]
[null,null,null,null,null,"and Soft Cost limits, and Operating Deficit Reserves."]
[]
[null,null,null,null,{"$f":"MAX(E$4:E5)+1","v":2},"If Housing Credit equity proceeds are being used as a source of financing, complete Columns 1 and 2, otherwise, complete "]
[null,null,null,null,null,"column 1 only. The various FHFC Program fees should be estimated and included in column 2 for at least the Housing Credit"]
[null,null,null,null,null,"Program, along with the MMRB Program, if applicable."]
[null,null,null,null,null,"General Contractor's fee is limited to 14% of actual construction cost (for Application purposes, this is represented by "]
[null,null,null,null,null,"A1.1. Column 3), rounded down to nearest dollar. The General Contractor's fee must be disclosed.  The General Contractor's "]
[null,null,null,null,null,"fee includes General Conditions, Overhead, and Profit."]
[null,null,null,null,null,"For Application purposes, the maximum hard and soft cost contingencies allowed cannot exceed 5% of hard and soft costs "]
[null,null,null,null,null,"(column 3 for A1.3. TOTAL ACTUAL CONSTRUCTION COSTS and column 3 for A2.1. TOTAL GENERAL DEVELOPMENT "]
[null,null,null,null,null,"COST, respectively), as further described in Rule Chapter 67-48, F.A.C., or this RFA. "]
[null,null,null,null,null,"new construction.  Otherwise the maximum is 15%.  The maximum soft cost contingency allowed cannot exceed "]
[null,null,null,null,null,"5% of the amount provided in column 3 for A2.1 TOTAL GENERAL DEVELOPMENT COST.  Limitations on these contingency "]
[null,null,null,null,null,"line items post-Application are provided in Rule Chapter 67-48, F.A.C. (if applicable) and this RFA."]
[null,null,null,null,null,"Operating Deficit Reserves (ODR) of any kind are not to be included in C. DEVELOPMENT COST and cannot be used in "]
[null,null,null,null,null,"determining the maximum Developer fee.  In addition, an ODR is not permitted in this Application at all.  If one has been "]
[null,null,null,null,null,"included, it will be removed by the scorer, reducing total costs.  However, one may be included during the credit underwriting "]
[null,null,null,null,null,"process where it will be sized. The final cost certification may include an ODR, but it cannot exceed the amount sized during "]
[null,null,null,null,null,"credit underwriting."]
[null,null,null,null,{"$f":"MAX(E$4:E23)+1","v":3},"Commercial, retail, and office space are not functionally related and subordinate to the residential units, and are not "]
[null,null,null,null,null,"considered to be community service facilities. As such, these costs are neither considered in eligible basis nor included"]
[null,null,null,null,null,"in the TDC PU Limitation process."]
[null,null,null,null,{"$f":"MAX(E$4:E27)+1","v":4},"Although the Corporation acknowledges that the costs listed on the Development Cost Pro Forma, Detail/Explanation Sheet, "]
[null,null,null,null,null,"Construction or Rehab Analysis and Permanent Analysis are subject to change during credit underwriting, such costs are "]
[null,null,null,null,null,"subject to the Total Development Cost Per Unit Limitation as provided in the RFA, as well as the other cost limitations provided "]
[null,null,null,null,null,"in Rule Chapter 67-48, F.A.C., as applicable."]
[null,null,null,null,{"$f":"MAX(E$4:E31)+1","v":5},"To the extent any variances occur between this Pro forma and the other worksheet tabs of Exhibit A., the responses in the other "]
[null,null,null,null,null,"worksheet tabs of Exhibit A. will take precedence."]
[]
[null,null,"USE THE DETAIL/EXPLANATION SHEET FOR EXPLANATION OF * ITEMS.  IF ADDITIONAL SPACE IS REQUIRED, ENTER THE"]
[null,null,"INFORMATION ON THE ADDENDA LOCATED AT THE END OF THE APPLICATION. "]
[]
[null,null,null,null,null,null,null,null,"What was the Development Category of the Proposed Development:",null,{"$f":"Funding!F13","v":0},null,null,null,null,{"$f":"IF(K38=\"Category Input Required\",\"**\",\"\")","v":""},null,"**","If a double asterisk is indicated within the Development Cost Pro Forma, there is an error on that line item."]
[null,null,null,null,null,null,null,null,"Indicate the number of total units in the proposed Development:",null,{"$f":"Funding!F14","v":0},null,null,null,null,{"$f":"IF(N(K39)=0,\"**\",\"\")","v":"**"}]
[null,null,null,null,null,null,{"$f":"IF(SUM(I45:I201)+SUM(L45:L201)>0,\"The \"&TEXT(SUM(I45:I201)+SUM(L45:L201),\"0\")&\" highlighted cell\"&IF(SUM(I45:I201)+SUM(L45:L201)>1,\"s\",\"\")&\" should be corrected to have a whole number\",\"\")","v":""},null,null,null,null,null,null,null,null,null,"Some Suggestive Assistance\nThe criteria below attempts to help the user to know the maximum limits of some cost items, when possible.  FHFC is not responsible for any programming errors related to the assistance offered below.  Applicant is responsible to verify all inputs to RFA criteria.\n*criteria will not be evaluated at time of Application, but will be evaluated at time of credit underwriting and final cost certification"]
[null,null,null,null,null,null,null,1,null,null,{"$f":"IF(E42=2,\"‡\",2)","v":"‡"},null,null,3]
[null,null,null,null,{"$f":"IF(ISERROR(VLOOKUP(Funding!F9,AppSubRptData,23)),\" \",IF(VLOOKUP(Funding!F9,AppSubRptData,23)=\"Yes\",3,2))","v":2},null,null,{"$f":"IF(E42=2,\"PROPOSED                                                                         COSTS\",\"HC ELIGIBLE                                                                               COSTS\")","v":"PROPOSED                                                                         COSTS"},null,null,{"$f":"IF(E42=2,\"See Note at Right\",\"HC INELIGIBLE\nCOSTS\")","v":"See Note at Right"},null,null,"TOTAL\nCOSTS"]
[null,"DEVELOPMENT COSTS"]
[null,null,"Actual Construction Costs ",null,null,null,null,null,null,null,null,null,null,null,null,null,{"$f":"IF(E42=2,\"‡ A Housing Credit Request Amount must be entered on the Funding Tab in order to view and input data into Column 2.\",\"\")","v":"‡ A Housing Credit Request Amount must be entered on the Funding Tab in order to view and input data into Column 2."}]
[null,null,null,"Accessory Buildings",null,null,null,null,null,null,null,{"$f":"IF(N(K45)<>ROUNDDOWN(N(K45),0),1,\"\")","v":""},null,{"$f":"IF(H45+IF($E$42=3,K45,0)=0,\"\",H45+IF($E$42=3,K45,0))","v":""}]
[]
[null,null,null,"Demolition",null,null,null,null,null,null,null,{"$f":"IF(N(K47)<>ROUNDDOWN(N(K47),0),1,\"\")","v":""},null,{"$f":"IF(AND($E$42=3,K47=0),\"\",IF(AND($E$42=3,K47>0),K47,IF(AND($E$42=2,H47=0),\"\",IF(AND($E$42=2,H47>0),H47))))","v":""},null,null,"The cost of demolition is to be excluded from eligible basis.*  "]
[]
[null,null,null,"Commercial/Retail Space See Note (3)",null,null,null,null,null,null,null,{"$f":"IF(N(K49)<>ROUNDDOWN(N(K49),0),1,\"\")","v":""},null,{"$f":"IF(AND($E$42=3,K49=0),\"\",IF(AND($E$42=3,K49>0),K49,IF(AND($E$42=2,H49=0),\"\",IF(AND($E$42=2,H49>0),H49))))","v":""},null,null,"The cost of commercial/retail space is to be excluded from eligible basis.*  "]
[]
[null,null,null,"New Rental Units",null,null,null,null,null,null,null,{"$f":"IF(N(K51)<>ROUNDDOWN(N(K51),0),1,\"\")","v":""},null,{"$f":"IF(H51+IF($E$42=3,K51,0)=0,\"\",H51+IF($E$42=3,K51,0))","v":""}]
[]
[null,null,null,"*Off-Site Work (explain in detail)",null,null,null,null,null,null,null,{"$f":"IF(N(K53)<>ROUNDDOWN(N(K53),0),1,\"\")","v":""},null,{"$f":"IF(H53+IF($E$42=3,K53,0)=0,\"\",H53+IF($E$42=3,K53,0))","v":""}]
[]
[null,null,null,"Recreational Amenities",null,null,null,null,null,null,null,{"$f":"IF(N(K55)<>ROUNDDOWN(N(K55),0),1,\"\")","v":""},null,{"$f":"IF(H55+IF($E$42=3,K55,0)=0,\"\",H55+IF($E$42=3,K55,0))","v":""}]
[]
[null,null,null,"Rehab of Existing Common Areas",null,null,null,null,null,null,null,{"$f":"IF(N(K57)<>ROUNDDOWN(N(K57),0),1,\"\")","v":""},null,{"$f":"IF(H57+IF($E$42=3,K57,0)=0,\"\",H57+IF($E$42=3,K57,0))","v":""}]
[]
[null,null,null,"Rehab of Existing Rental Units",null,null,null,null,null,null,null,{"$f":"IF(N(K59)<>ROUNDDOWN(N(K59),0),1,\"\")","v":""},null,{"$f":"IF(H59+IF($E$42=3,K59,0)=0,\"\",H59+IF($E$42=3,K59,0))","v":""}]
[]
{"$rows_left_out":422}